BDBM50049004 CHEMBL3315219
SMILES CC(C)C[C@@H](NC(=O)Cn1ccc2cc(ccc12)-c1cccc2ccccc12)C(O)=O
InChI Key InChIKey=AFTDNGSNOSIHDJ-HSZRJFAPSA-N
Data  1 EC50
  Tab Delimited (TSV)   2D SDfile   Computed 3D by Vconf -m prep SDfile
Find this compound or compounds like it in BindingDB:
Activity Spreadsheet -- Enzyme Inhibition Constant Data from BindingDB
Found 1 hit for monomerid = 50049004
TargetNeurotensin receptor type 1(Homo sapiens (Human))
The Scripps Research Institute
Curated by ChEMBL
LigandPNGBDBM50049004(CHEMBL3315219)
Affinity DataEC50: >1.00E+5nM. Assay description: Agonist activity at NTSR1 (unknown origin) expressed in CHO cells assessed as potentiation of NT(8-13) peptide-induced change in intracellular Ca2+ l...
In DepthDetails ArticlePubMed